Reaction Details
TargetBifunctional dihydrofolate reductase-thymidylate synthase
LigandBDBM50138964
Substrate/Competitorn/a
Meas. Tech.ChEMBL_55275 (CHEMBL663728)
Ki 771±n/a nM
Citation Kamchonwongpaisan, SQuarrell, RCharoensetakul, NPonsinet, RVilaivan, TVanichtanankul, JTarnchompoo, BSirawaraporn, WLowe, GYuthavong, Y Inhibitors of multiple mutants of Plasmodium falciparum dihydrofolate reductase and their antimalarial activities. J Med Chem47:673-80 (2004) 
 
Bifunctional dihydrofolate reductase-thymidylate synthase
Name:Bifunctional dihydrofolate reductase-thymidylate synthase
Type:Enzyme
Mol. Mass.:71822.51
Organism:Plasmodium falciparum (isolate K1 / Thailand)
Description:The mutant clone was prepared by cassette mutagenesis using wildtype pfDHFR as a template, and expressed in E. coli.
Residue:608
BDBM50138964
NameBDBM50138964
Synonyms:6-(3-Benzyloxy-phenyl)-1-(4-chloro-phenyl)-1,6-dihydro-[1,3,5]triazine-2,4-diamine | CHEMBL351099
TypeSmall organic molecule
Emp. Form.C22H20ClN5O
Mol. Mass.405.88
SMILESNC1=NC(N(C(N)=N1)c1ccc(Cl)cc1)c1cccc(OCc2ccccc2)c1