Reaction Details
TargetBifunctional dihydrofolate reductase-thymidylate synthase
LigandBDBM18778
Substrate/Competitorn/a
Meas. Tech.ChEMBL_55398 (CHEMBL880697)
Ki 360±n/a nM
Citation Kamchonwongpaisan, SQuarrell, RCharoensetakul, NPonsinet, RVilaivan, TVanichtanankul, JTarnchompoo, BSirawaraporn, WLowe, GYuthavong, Y Inhibitors of multiple mutants of Plasmodium falciparum dihydrofolate reductase and their antimalarial activities. J Med Chem47:673-80 (2004) 
 
Bifunctional dihydrofolate reductase-thymidylate synthase
Name:Bifunctional dihydrofolate reductase-thymidylate synthase
Type:Enzyme
Mol. Mass.:71822.51
Organism:Plasmodium falciparum (isolate K1 / Thailand)
Description:The mutant clone was prepared by cassette mutagenesis using wildtype pfDHFR as a template, and expressed in E. coli.
Residue:608
BDBM18778
NameBDBM18778
Synonyms:CHEMBL22405 methyl 4-[2,6-diamino-5-(4-chlorophenyl)pyrimidin-4-yl]butanoate
TypeSmall organic molecule
Emp. Form.C15H17ClN4O2
Mol. Mass.320.774
SMILESCOC(=O)CCCc1nc(N)nc(N)c1-c1ccc(Cl)cc1