Reaction Details
TargetBifunctional dihydrofolate reductase-thymidylate synthase
LigandBDBM50138952
Substrate/Competitorn/a
Meas. Tech.ChEMBL_155798 (CHEMBL760860)
IC50 140±n/a nM
Citation Kamchonwongpaisan, SQuarrell, RCharoensetakul, NPonsinet, RVilaivan, TVanichtanankul, JTarnchompoo, BSirawaraporn, WLowe, GYuthavong, Y Inhibitors of multiple mutants of Plasmodium falciparum dihydrofolate reductase and their antimalarial activities. J Med Chem47:673-80 (2004) 
 
Bifunctional dihydrofolate reductase-thymidylate synthase
Name:Bifunctional dihydrofolate reductase-thymidylate synthase
Type:Enzyme
Mol. Mass.:71822.51
Organism:Plasmodium falciparum (isolate K1 / Thailand)
Description:The mutant clone was prepared by cassette mutagenesis using wildtype pfDHFR as a template, and expressed in E. coli.
Residue:608
BDBM50138952
NameBDBM50138952
Synonyms:1-(3-Chloro-phenyl)-6-heptyl-1,6-dihydro-[1,3,5]triazine-2,4-diamine CHEMBL346963
TypeSmall organic molecule
Emp. Form.C16H24ClN5
Mol. Mass.321.848
SMILESCCCCCCCC1N=C(N)N=C(N)N1c1cccc(Cl)c1