Reaction Details
TargetMu-type opioid receptor
LigandBDBM50139015
Substrate/Competitorn/a
Meas. Tech.ChEMBL_149018 (CHEMBL758582)
Ki 0.97±n/a nM
Citation Tömböly, CKövér, KEPéter, ATourwé, DBiyashev, DBenyhe, SBorsodi, AAl-Khrasani, MRónai, AZTóth, G Structure-activity study on the Phe side chain arrangement of endomorphins using conformationally constrained analogues. J Med Chem47:735-43 (2004) 
 
Mu-type opioid receptor
Name:Mu-type opioid receptor
Type:G Protein-Coupled Receptor (GPCR)
Mol. Mass.:44503.11
Organism:Rattus norvegicus (rat)
Description:Competition binding assays were carried out using membrane preparations from transfected HN9.10 cells that constitutively expressed the mu opioid receptor.
Residue:398
BDBM50139015
NameBDBM50139015
Synonyms:(S)-1-[(S)-2-Amino-3-(4-hydroxy-phenyl)-propionyl]-pyrrolidine-2-carboxylic acid [(S)-1-((1S,2S)-1-carbamoyl-2-phenyl-propylcarbamoyl)-2-phenyl-ethyl]-amide | CHEMBL436039
TypeSmall organic molecule
Emp. Form.C33H39N5O5
Mol. Mass.585.6933
SMILESC[C@H]([C@H](NC(=O)[C@H](Cc1ccccc1)NC(=O)[C@@H]1CCCN1C(=O)[C@@H](N)Cc1ccc(O)cc1)C(N)=O)c1ccccc1