Reaction Details
TargetDelta-type opioid receptor
LigandBDBM50095155
Substrate/Competitorn/a
Meas. Tech.ChEMBL_147064 (CHEMBL754884)
Ki 6390±n/a nM
Citation Tömböly, CKövér, KEPéter, ATourwé, DBiyashev, DBenyhe, SBorsodi, AAl-Khrasani, MRónai, AZTóth, G Structure-activity study on the Phe side chain arrangement of endomorphins using conformationally constrained analogues. J Med Chem47:735-43 (2004) 
 
Delta-type opioid receptor
Name:Delta-type opioid receptor
Type:G Protein-Coupled Receptor (GPCR)
Mol. Mass.:40465.04
Organism:Rattus norvegicus (rat)
Description:Competition binding assays were using CHO-K1 cell membranes expressing the opioid receptor.
Residue:372
BDBM50095155
NameBDBM50095155
Synonyms:(S)-1-[(S)-2-Amino-3-(4-hydroxy-phenyl)-propionyl]-pyrrolidine-2-carboxylic acid [(S)-1-((S)-1-carbamoyl-2-phenyl-ethylcarbamoyl)-2-(1H-indol-3-yl)-ethyl]-amide 1-[(S)-2-Amino-3-(4-hydroxy-phenyl)-propionyl]-pyrrolidine-2-carboxylic acid [1-((S)-(S)-1-carbamoyl-2-phenyl-ethylcarbamoyl)-2-(1H-indol-3-yl)-ethyl]-amide CHEMBL316446 H-Tyr-Pro-Trp-Phe-NH2 YPWF-NH2 | endomorphin -1
TypeSmall organic molecule
Emp. Form.C34H38N6O5
Mol. Mass.610.7027
SMILESN[C@@H](Cc1ccc(O)cc1)C(=O)N1CCC[C@H]1C(=O)N[C@@H](Cc1c[nH]c2ccccc12)C(=O)N[C@@H](Cc1ccccc1)C(N)=O