Reaction Details
TargetMelanocortin receptor 4
LigandBDBM50139032
Substrate/Competitorn/a
Meas. Tech.ChEMBL_106179 (CHEMBL714598)
Ki 27±n/a nM
Citation Richardson, TIOrnstein, PLBriner, KFisher, MJBacker, RTBiggers, CKClay, MPEmmerson, PJHertel, LWHsiung, HMHusain, SKahl, SDLee, JALindstrom, TDMartinelli, MJMayer, JPMullaney, JTO'Brien, TPPawlak, JMRevell, KDShah, JZgombick, JMHerr, RJMelekhov, ASampson, PBKing, CH Synthesis and structure-activity relationships of novel arylpiperazines as potent and selective agonists of the melanocortin subtype-4 receptor. J Med Chem47:744-55 (2004) 
 
Melanocortin receptor 4
Name:Melanocortin receptor 4
Type:Enzyme
Mol. Mass.:36949.50
Organism:Homo sapiens (Human)
Description:P32245
Residue:332
BDBM50139032
NameBDBM50139032
Synonyms:1,2,3,4-Tetrahydro-isoquinoline-3-carboxylic acid {(R)-1-(4-chloro-benzyl)-2-oxo-2-[4-(2-piperidin-1-ylmethyl-phenyl)-piperazin-1-yl]-ethyl}-amide | CHEMBL349886
TypeSmall organic molecule
Emp. Form.C35H42ClN5O2
Mol. Mass.600.193
SMILESClc1ccc(C[C@@H](NC(=O)[C@H]2Cc3ccccc3CN2)C(=O)N2CCN(CC2)c2ccccc2CN2CCCCC2)cc1