Reaction Details
TargetIntegrin alpha-4/beta-1
LigandBDBM50139093
Substrate/Competitorn/a
Meas. Tech.ChEMBL_88913 (CHEMBL699815)
IC50 81±n/a nM
Citation Dyatkin, ABHoekstra, WJKinney, WAKontoyianni, MSantulli, RJKimball, ESFisher, MCCarolyn Fisher, MProuty, SMAbraham, WMde Garavilla, LAndrade-Gordon, PHlasta, DJHe, WHornby, PJDamiano, BPMaryanoff, BE Aza-bicyclic amino acid sulfonamides as alpha(4)beta(1)/alpha(4)beta(7) integrin antagonists. Bioorg Med Chem Lett14:591-6 (2004) Integrin alpha-4/beta-1
Name:Integrin alpha-4/beta-1
Type:n/a
Mol. Mass.:n/a
Description:ASSAY_ID of EBI is 88912
Components:This complex has 2 components.
Component 1
Name:Integrin beta-1
Synonyms:CD_antigen=CD29 Fibronectin receptor beta GPIIA ITGB1 MDF2 | MSK12
Type:Enzyme
Mol. Mass.:88400.38
Organism:Homo sapiens (Human)
Description:P05556
Residue:798
Component 2
Name:Integrin alpha-4
Synonyms:CD49 antigen-like family member D CD49d antigen ITA4_HUMAN Integrin alpha-4 Integrin alpha-IV VLA-4 integrin alpha 4 precursor | integrin alpha-4 precursor
Type:Membrane Protein
Mol. Mass.:114897.35
Organism:Homo sapiens (Human)
Description:P13612
Residue:1032
BDBM50139093
NameBDBM50139093
Synonyms:(S)-2-[(2-Benzenesulfonyl-2-aza-bicyclo[2.2.2]octane-3-carbonyl)-amino]-3-(2',6'-dimethoxy-biphenyl-4-yl)-propionic acid | CHEMBL154518
TypeSmall organic molecule
Emp. Form.C31H34N2O7S
Mol. Mass.578.676
SMILESCOc1cccc(OC)c1-c1ccc(C[C@H](NC(=O)[C@@H]2C3CCC(CC3)N2S(=O)(=O)c2ccccc2)C(O)=O)cc1