Reaction Details
TargetCathepsin D
LigandBDBM50139109
Substrate/Competitorn/a
Meas. Tech.ChEBML_45323
Ki 2200±n/a nM
Citation Brady, SFSingh, SCrouthamel, MCHolloway, MKCoburn, CAGarsky, VMBogusky, MPennington, MWVacca, JPHazuda, DLai, MT Rational design and synthesis of selective BACE-1 inhibitors. Bioorg Med Chem Lett14:601-4 (2004) Cathepsin D
Name:Cathepsin D
Type:Enzyme
Mol. Mass.:44551.72
Organism:Homo sapiens (Human)
Description:Human proCathepsin D (SwissProt accession number P07339) was expressed in Sf9 cells, purified, and autoactivated.
Residue:412
BDBM50139109
NameBDBM50139109
Synonyms:(S)-N-((1S,2S,4R)-6-Acetoxy-1-benzyl-2-hydroxy-4-isobutylcarbamoyl-hexyl)-2-(3-methyl-butyrylamino)-succinamic acid | CHEMBL154897
TypeSmall organic molecule
Emp. Form.C29H45N3O8
Mol. Mass.563.6829
SMILESCC(C)CNC(=O)[C@H](CCOC(C)=O)C[C@H](O)[C@H](Cc1ccccc1)NC(=O)C[C@H](NC(=O)CC(C)C)C(O)=O