Reaction Details
TargetHistamine H3 receptor
LigandBDBM50139260
Substrate/Competitorn/a
Meas. Tech.ChEBML_86753
Ki 2.6±n/a nM
Citation Gfesser, GAZhang, HDinges, JFox, GBPan, JBEsbenshade, TAYao, BBWitte, DMiller, TRKang, CHKrueger, KMBennani, YLHancock, AAFaghih, R Structure-activity relationships of non-imidazole H(3) receptor ligands. Part 3: 5-Substituted 3-phenyl-1,2,4-oxadiazoles as potent antagonists. Bioorg Med Chem Lett14:673-6 (2004) Histamine H3 receptor
Name:Histamine H3 receptor
Type:G Protein-Coupled Receptor (GPCR)
Mol. Mass.:48607.98
Organism:Rattus norvegicus (rat)
Description:n/a
Residue:445
BDBM50139260
NameBDBM50139260
Synonyms:CHEMBL157534 | Furan-2-carboxylic acid [(R)-2-(4-{3-[4-(5-cyclohexylmethyl-[1,2,4]oxadiazol-3-yl)-3-fluoro-phenoxy]-propyl}-[1,4]diazepan-1-yl)-1-methyl-2-oxo-ethyl]-amide
TypeSmall organic molecule
Emp. Form.C31H40FN5O5
Mol. Mass.581.6782
SMILESC[C@@H](NC(=O)c1ccco1)C(=O)N1CCCN(CCCOc2ccc(-c3noc(CC4CCCCC4)n3)c(F)c2)CC1