Reaction Details
TargetHistamine H3 receptor
LigandBDBM50139289
Substrate/Competitorn/a
Meas. Tech.ChEBML_86753
Ki 0.940000±n/a nM
Citation Gfesser, GAZhang, HDinges, JFox, GBPan, JBEsbenshade, TAYao, BBWitte, DMiller, TRKang, CHKrueger, KMBennani, YLHancock, AAFaghih, R Structure-activity relationships of non-imidazole H(3) receptor ligands. Part 3: 5-Substituted 3-phenyl-1,2,4-oxadiazoles as potent antagonists. Bioorg Med Chem Lett14:673-6 (2004) Histamine H3 receptor
Name:Histamine H3 receptor
Type:G Protein-Coupled Receptor (GPCR)
Mol. Mass.:48607.98
Organism:Rattus norvegicus (rat)
Description:n/a
Residue:445
BDBM50139289
NameBDBM50139289
Synonyms:CHEMBL443817 | Furan-2-carboxylic acid [(R)-2-(4-{3-[3-fluoro-4-(5-phenethyl-[1,2,4]oxadiazol-3-yl)-phenoxy]-propyl}-[1,4]diazepan-1-yl)-1-methyl-2-oxo-ethyl]-amide
TypeSmall organic molecule
Emp. Form.C32H36FN5O5
Mol. Mass.589.6571
SMILESC[C@@H](NC(=O)c1ccco1)C(=O)N1CCCN(CCCOc2ccc(-c3noc(CCc4ccccc4)n3)c(F)c2)CC1