Reaction Details
TargetHistamine H3 receptor
LigandBDBM50139265
Substrate/Competitorn/a
Meas. Tech.ChEBML_86753
Ki 1.3±n/a nM
Citation Gfesser, GAZhang, HDinges, JFox, GBPan, JBEsbenshade, TAYao, BBWitte, DMiller, TRKang, CHKrueger, KMBennani, YLHancock, AAFaghih, R Structure-activity relationships of non-imidazole H(3) receptor ligands. Part 3: 5-Substituted 3-phenyl-1,2,4-oxadiazoles as potent antagonists. Bioorg Med Chem Lett14:673-6 (2004) Histamine H3 receptor
Name:Histamine H3 receptor
Type:G Protein-Coupled Receptor (GPCR)
Mol. Mass.:48607.98
Organism:Rattus norvegicus (rat)
Description:n/a
Residue:445
BDBM50139265
NameBDBM50139265
Synonyms:CHEMBL351101 | N-[(R)-2-(4-{3-[4-(5-Cyclopentylmethyl-[1,2,4]oxadiazol-3-yl)-3-fluoro-phenoxy]-propyl}-[1,4]diazepan-1-yl)-1-methyl-2-oxo-ethyl]-isobutyramide
TypeSmall organic molecule
Emp. Form.C29H42FN5O4
Mol. Mass.543.6733
SMILESCC(C)C(=O)N[C@H](C)C(=O)N1CCCN(CCCOc2ccc(-c3noc(CC4CCCC4)n3)c(F)c2)CC1