Reaction Details
Target5-hydroxytryptamine receptor 1A
LigandBDBM50139354
Substrate/Competitorn/a
Meas. Tech.ChEBML_912
Ki 41±n/a nM
Citation Thomson, CGBeer, MSCurtis, NRDiggle, HJHandford, EKulagowski, JJ Thiazoles and thiopyridines: novel series of high affinity h5HT(7) ligands. Bioorg Med Chem Lett14:677-80 (2004) 5-hydroxytryptamine receptor 1A
Name:5-hydroxytryptamine receptor 1A
Type:n/a
Mol. Mass.:46122.49
Organism:Homo sapiens (Human)
Description:n/a
Residue:422
BDBM50139354
NameBDBM50139354
Synonyms:1-[6-(2-Dimethylamino-ethylsulfanyl)-pyridin-2-yl]-cyclohexanol | CHEMBL159143
TypeSmall organic molecule
Emp. Form.C15H24N2OS
Mol. Mass.280.429
SMILESCN(C)CCSc1cccc(n1)C1(O)CCCCC1