Reaction Details
Target5-hydroxytryptamine receptor 7
LigandBDBM50139351
Substrate/Competitorn/a
Meas. Tech.ChEBML_3690
Ki 0.700000±n/a nM
Citation Thomson, CGBeer, MSCurtis, NRDiggle, HJHandford, EKulagowski, JJ Thiazoles and thiopyridines: novel series of high affinity h5HT(7) ligands. Bioorg Med Chem Lett14:677-80 (2004) 5-hydroxytryptamine receptor 7
Name:5-hydroxytryptamine receptor 7
Type:G Protein-Coupled Receptor (GPCR)
Mol. Mass.:53573.08
Organism:Homo sapiens (Human)
Description:P34969
Residue:479
BDBM50139351
NameBDBM50139351
Synonyms:2-(6-cyclohexylpyridin-2-ylthio)-N,N-dimethylethanamine [2-(6-Cyclohexyl-pyridin-2-ylsulfanyl)-ethyl]-dimethyl-amine
TypeSmall organic molecule
Emp. Form.C15H24N2S
Mol. Mass.264.429
SMILESCN(C)CCSc1cccc(n1)C1CCCCC1