Reaction Details
TargetHistamine H3 receptor
LigandBDBM50139407
Substrate/Competitorn/a
Meas. Tech.ChEMBL_83647 (CHEMBL693107)
Ki 2.4±n/a nM
Citation Cowart, MPratt, JKStewart, AOBennani, YLEsbenshade, TAHancock, AA A new class of potent non-imidazole H(3) antagonists: 2-aminoethylbenzofurans. Bioorg Med Chem Lett14:689-93 (2004) Histamine H3 receptor
Name:Histamine H3 receptor
Type:G Protein-Coupled Receptor (GPCR)
Mol. Mass.:48691.47
Organism:Homo sapiens (Human)
Description:Binding assays were using CHO cells stably expressing hH3R receptors.
Residue:445
BDBM50139407
NameBDBM50139407
Synonyms:4-{2-[2-((2R,6S)-2,6-Dimethyl-piperidin-1-yl)-ethyl]-benzofuran-5-yl}-benzonitrile | CHEMBL162591
TypeSmall organic molecule
Emp. Form.C24H26N2O
Mol. Mass.358.476
SMILESC[C@H]1CCC[C@@H](C)N1CCc1cc2cc(ccc2o1)-c1ccc(cc1)C#N