Reaction Details
TargetProtein farnesyltransferase subunit beta/geranylgeranyltransferase type-1 subunit alpha
LigandBDBM50139589
Substrate/Competitorn/a
Meas. Tech.ChEBML_68492
IC50 62±n/a nM
Citation Le Diguarher, TOrtuno, JCShanks, DGuilbaud, NPierré, ARaimbaud, EFauchère, JLHickman, JATucker, GCCasara, PJ Synthesis of N,N'-disubstituted 3-aminobenzo[c] and [d]azepin-2-ones as potent and specific farnesyl transferase inhibitors. Bioorg Med Chem Lett14:767-71 (2004) Protein farnesyltransferase subunit beta/geranylgeranyltransferase type-1 subunit alpha
Name:Protein farnesyltransferase subunit beta/geranylgeranyltransferase type-1 subunit alpha
Type:Protein Complex
Mol. Mass.:n/a
Description:To express recombinant enzyme in E. coli, the cloned human alpha and beta subunits were co-expressed from a plasmid, in which their expression was translationally coupled.
Components:This complex has 2 components.
Component 1
Name:Protein farnesyltransferase subunit beta
Synonyms:CAAX farnesyltransferase subunit alpha FNTB FTase-alpha GGTase-I-alpha Protein farnesyl/geranylgeranyl transferase Protein farnesyltransferase subunit beta Protein farnesyltransferase/geranylgeranyltransferase type-1 subunit alpha Ras proteins prenyltransferase subunit beta | Type I protein geranyl-geranyltransferase subunit alpha
Type:Enzyme Subunit
Mol. Mass.:48766.02
Organism:Homo sapiens (Human)
Description:Protein farnesyltransferase subunit beta
Residue:437
Component 2
Name:Protein farnesyltransferase/geranylgeranyltransferase type-1 subunit alpha
Synonyms:CAAX farnesyltransferase alpha subunit FNTA_HUMAN FTase-alpha Geranylgeranyl Transferase (GGTase-I) Chain A Protein Farnesyltransferase (PFT) Chain A Protein farnesyltransferase Protein farnesyltransferase/geranylgeranyltransferase type I alpha subunit | Ras proteins prenyltransferase alpha
Type:Enzyme
Mol. Mass.:44392.46
Organism:Homo sapiens (Human)
Description:Recombinant human FTase.
Residue:379
BDBM50139589
NameBDBM50139589
Synonyms:4-(5-{[3-(3,5-Difluoro-phenyl)-2-oxo-2,3,4,5-tetrahydro-1H-benzo[d]azepin-1-ylamino]-methyl}-imidazol-1-ylmethyl)-benzonitrile | CHEMBL349598
TypeSmall organic molecule
Emp. Form.C28H23F2N5O
Mol. Mass.483.5119
SMILESFc1cc(F)cc(c1)N1CCc2ccccc2C(NCc2cncn2Cc2ccc(cc2)C#N)C1=O