Reaction Details
TargetGenome polyprotein
LigandBDBM50139666
Substrate/Competitorn/a
Meas. Tech.ChEBML_79054
IC50 390±n/a nM
Citation Chan, LDas, SKReddy, TJPoisson, CProulx, MPereira, OCourchesne, MRoy, CWang, WSiddiqui, AYannopoulos, CGNguyen-Ba, NLabrecque, DBethell, RHamel, MCourtemanche-Asselin, PL'Heureux, LDavid, MNicolas, OBrunette, SBilimoria, DBédard, J Discovery of thiophene-2-carboxylic acids as potent inhibitors of HCV NS5B polymerase and HCV subgenomic RNA replication. Part 1: Sulfonamides. Bioorg Med Chem Lett14:793-6 (2004) Genome polyprotein
Name:Genome polyprotein
Type:Protein
Mol. Mass.:327266.82
Organism:Hepatitis C virus (HCV)
Description:P26664
Residue:3011
BDBM50139666
NameBDBM50139666
Synonyms:5-(4-Acetyl-phenyl)-3-(2,4-dimethyl-benzenesulfonylamino)-thiophene-2-carboxylic acid | CHEMBL354813
TypeSmall organic molecule
Emp. Form.C21H19NO5S2
Mol. Mass.429.509
SMILESCC(=O)c1ccc(cc1)-c1cc(NS(=O)(=O)c2ccc(C)cc2C)c(s1)C(O)=O