Reaction Details
TargetCaspase-1
LigandBDBM50139703
Substrate/Competitorn/a
Meas. Tech.ChEBML_46518
Ki 65000±n/a nM
Citation Harter, WGAlbrect, HBrady, KCaprathe, BDunbar, JGilmore, JHays, SKostlan, CRLunney, BWalker, N The design and synthesis of sulfonamides as caspase-1 inhibitors. Bioorg Med Chem Lett14:809-12 (2004) Caspase-1
Name:Caspase-1
Type:Enzyme
Mol. Mass.:45154.13
Organism:Homo sapiens (Human)
Description:P29466
Residue:404
BDBM50139703
NameBDBM50139703
Synonyms:3-Benzyloxycarbonylamino-5-(indan-1-ylmethanesulfonylamino)-4-oxo-pentanoic acid | CHEMBL167544
TypeSmall organic molecule
Emp. Form.C23H26N2O7S
Mol. Mass.474.527
SMILESOC(=O)CC(NC(=O)OCc1ccccc1)C(=O)CNS(=O)(=O)CC1CCc2ccccc12