Reaction Details
TargetCaspase-1
LigandBDBM50139695
Substrate/Competitorn/a
Meas. Tech.ChEMBL_46518 (CHEMBL659312)
IC50 3.4±n/a nM
Citation Harter, WGAlbrect, HBrady, KCaprathe, BDunbar, JGilmore, JHays, SKostlan, CRLunney, BWalker, N The design and synthesis of sulfonamides as caspase-1 inhibitors. Bioorg Med Chem Lett14:809-12 (2004) Caspase-1
Name:Caspase-1
Type:Enzyme
Mol. Mass.:45154.13
Organism:Homo sapiens (Human)
Description:P29466
Residue:404
BDBM50139695
NameBDBM50139695
Synonyms:3-((S)-2-{(S)-2-[2-((S)-Acetylamino)-3-(4-hydroxy-phenyl)-propionylamino]-4-carboxy-butyrylamino}-propionylamino)-4-oxo-5-(2-phenyl-ethanesulfonylamino)-pentanoic acid | CHEMBL412811
TypeSmall organic molecule
Emp. Form.C32H41N5O12S
Mol. Mass.719.759
SMILESC[C@H](NC(=O)[C@H](CCC(O)=O)NC(=O)[C@H](Cc1ccc(O)cc1)NC(C)=O)C(=O)NC(CC(O)=O)C(=O)CNS(=O)(=O)CCc1ccccc1