Reaction Details
TargetSolute carrier family 15 member 1
LigandBDBM50139893
Substrate/Competitorn/a
Meas. Tech.ChEMBL_89214 (CHEMBL699706)
IC50 40500±n/a nM
Citation Våbenø, JLejon, TNielsen, CUSteffansen, BChen, WOuyang, HBorchardt, RTLuthman, K Phe-Gly dipeptidomimetics designed for the di-/tripeptide transporters PEPT1 and PEPT2: synthesis and biological investigations. J Med Chem47:1060-9 (2004) 
 
Solute carrier family 15 member 1
Name:Solute carrier family 15 member 1
Type:PROTEIN
Mol. Mass.:78818.07
Organism:Homo sapiens (Human)
Description:ChEMBL_1488839
Residue:708
BDBM50139893
NameBDBM50139893
Synonyms:(E)-(S)-5-Amino-4-(S)-hydroxy-6-phenyl-hex-2-enoic acid | CHEMBL274764
TypeSmall organic molecule
Emp. Form.C12H15NO3
Mol. Mass.221.2524
SMILESN[C@@H](Cc1ccccc1)[C@@H](O)\C=C\C(O)=O