Reaction Details
TargetSodium-dependent serotonin transporter
LigandBDBM50139954
Substrate/Competitorn/a
Meas. Tech.ChEMBL_201479 (CHEMBL804588)
Ki 1.35±n/a nM
Citation Plisson, CMcConathy, JMartarello, LMalveaux, EJCamp, VMWilliams, LVotaw, JRGoodman, MM Synthesis, radiosynthesis, and biological evaluation of carbon-11 and iodine-123 labeled 2beta-carbomethoxy-3beta-[4'-((Z)-2-haloethenyl)phenyl]tropanes: candidate radioligands for in vivo imaging of the serotonin transporter. J Med Chem47:1122-35 (2004) 
 
Sodium-dependent serotonin transporter
Name:Sodium-dependent serotonin transporter
Type:Multi-pass membrane protein
Mol. Mass.:70322.51
Organism:Homo sapiens (Human)
Description:P31645
Residue:630
BDBM50139954
NameBDBM50139954
Synonyms:3-[4-(2,2-Dibromo-vinyl)-phenyl]-8-methyl-8-aza-bicyclo[3.2.1]octane-2-carboxylic acid methyl ester | CHEMBL14924
TypeSmall organic molecule
Emp. Form.C18H21Br2NO2
Mol. Mass.443.173
SMILES[#6]-[#8]-[#6](=O)-[#6]-1-[#6]-2-[#6]-[#6]-[#6](-[#6]-[#6]-1-c1ccc(\[#6]=[#6](/Br)Br)cc1)-[#7]-2-[#6]