Reaction Details
TargetNeuronal acetylcholine receptor subunit alpha-3/beta-2
LigandBDBM50140090
Substrate/Competitorn/a
Meas. Tech.ChEMBL_143243 (CHEMBL752531)
IC50 99±n/a nM
Citation Loughnan, MLNicke, AJones, AAdams, DJAlewood, PFLewis, RJ Chemical and functional identification and characterization of novel sulfated alpha-conotoxins from the cone snail Conus anemone. J Med Chem47:1234-41 (2004) 
 
Neuronal acetylcholine receptor subunit alpha-3/beta-2
Name:Neuronal acetylcholine receptor subunit alpha-3/beta-2
Type:Protein
Mol. Mass.:n/a
Description:n/a
Components:This complex has 2 components.
Component 1
Name:Neuronal acetylcholine receptor subunit alpha-3
Synonyms:ACHA3_RAT Chrna3
Type:Enzyme
Mol. Mass.:56995.52
Organism:Rattus norvegicus (Rat)
Description:P04757
Residue:499
Component 2
Name:Neuronal acetylcholine receptor subunit beta-2
Synonyms:ACHB2_RAT Chrnb2 Neuronal acetylcholine receptor non-alpha-1 chain
Type:Enzyme
Mol. Mass.:56910.32
Organism:Rattus norvegicus (Rat)
Description:P12390
Residue:500
BDBM50140090
NameBDBM50140090
Synonyms:CHEMBL217150 | RDPCCSNPVCTVHNPQIC*
TypeSmall organic molecule
Emp. Form.C65H99N19O22S4
Mol. Mass.1626.856
SMILESCC(C)C[C@@H](NC(=O)[C@@H](CO)NC(=O)[C@@H](CS)NC(=O)[C@@H](CS)NC(=O)CN)C(=O)N1CCC[C@H]1C(=O)N1CCC[C@H]1C(=O)N[C@@H](CS)C(=O)N[C@@H](C)C(=O)N[C@@H](C)C(=O)N[C@@H](CC(N)=O)C(=O)N[C@@H](CC(N)=O)C(=O)N1CCC[C@@H]1C(=O)N[C@@H](CC(O)=O)C(=O)N[C@@H](Cc1ccc(O)cc1)C(=O)N[C@@H](CS)C(N)=O