Reaction Details
TargetCannabinoid receptor 1
LigandBDBM50140216
Substrate/Competitorn/a
Meas. Tech.ChEBML_46467
Ki 32±n/a nM
Citation Dyck, BGoodfellow, VSPhillips, TGrey, JHaddach, MRowbottom, MNaeve, GSBrown, BSaunders, J Potent imidazole and triazole CB1 receptor antagonists related to SR141716. Bioorg Med Chem Lett14:1151-4 (2004) 
 
Cannabinoid receptor 1
Name:Cannabinoid receptor 1
Type:G Protein-Coupled Receptor (GPCR)
Mol. Mass.:52868.96
Organism:Homo sapiens (Human)
Description:P21554
Residue:472
BDBM50140216
NameBDBM50140216
Synonyms:CHEMBL416535 | [5-(4-Chloro-phenyl)-1-(2,4-dichloro-phenyl)-1H-[1,2,4]triazol-3-yl]-[4-(3-trifluoromethyl-phenyl)-piperazin-1-yl]-methanone
TypeSmall organic molecule
Emp. Form.C26H19Cl3F3N5O
Mol. Mass.580.816
SMILESFC(F)(F)c1cccc(c1)N1CCN(CC1)C(=O)c1nc(-c2ccc(Cl)cc2)n(n1)-c1ccc(Cl)cc1Cl