Reaction Details
TargetCannabinoid receptor 1
LigandBDBM50140222
Substrate/Competitorn/a
Meas. Tech.ChEBML_46467
Ki 11±n/a nM
Citation Dyck, BGoodfellow, VSPhillips, TGrey, JHaddach, MRowbottom, MNaeve, GSBrown, BSaunders, J Potent imidazole and triazole CB1 receptor antagonists related to SR141716. Bioorg Med Chem Lett14:1151-4 (2004) 
 
Cannabinoid receptor 1
Name:Cannabinoid receptor 1
Type:G Protein-Coupled Receptor (GPCR)
Mol. Mass.:52868.96
Organism:Homo sapiens (Human)
Description:P21554
Residue:472
BDBM50140222
NameBDBM50140222
Synonyms:5-Bromo-1-(4-chloro-phenyl)-2-(2,4-dichloro-phenyl)-1H-imidazole-4-carboxylic acid (hexahydro-cyclopenta[c]pyrrol-2-yl)-amide | CHEMBL15966
TypeSmall organic molecule
Emp. Form.C23H20BrCl3N4O
Mol. Mass.554.694
SMILESClc1ccc(cc1)-n1c(Br)c(nc1-c1ccc(Cl)cc1Cl)C(=O)NN1CC2CCCC2C1