Reaction Details
TargetCannabinoid receptor 1
LigandBDBM50140227
Substrate/Competitorn/a
Meas. Tech.ChEBML_46467
Ki 770±n/a nM
Citation Dyck, BGoodfellow, VSPhillips, TGrey, JHaddach, MRowbottom, MNaeve, GSBrown, BSaunders, J Potent imidazole and triazole CB1 receptor antagonists related to SR141716. Bioorg Med Chem Lett14:1151-4 (2004) 
 
Cannabinoid receptor 1
Name:Cannabinoid receptor 1
Type:G Protein-Coupled Receptor (GPCR)
Mol. Mass.:52868.96
Organism:Homo sapiens (Human)
Description:P21554
Residue:472
BDBM50140227
NameBDBM50140227
Synonyms:1-(4-Chloro-phenyl)-2-(2,4-dichloro-phenyl)-5-ethynyl-1H-imidazole-4-carboxylic acid (hexahydro-cyclopenta[c]pyrrol-2-yl)-amide | CHEMBL418544
TypeSmall organic molecule
Emp. Form.C25H21Cl3N4O
Mol. Mass.499.819
SMILESClc1ccc(cc1)-n1c(nc(C(=O)NN2CC3CCCC3C2)c1C#C)-c1ccc(Cl)cc1Cl