Reaction Details
TargetCannabinoid receptor 1
LigandBDBM50140229
Substrate/Competitorn/a
Meas. Tech.ChEBML_46467
Ki 101±n/a nM
Citation Dyck, BGoodfellow, VSPhillips, TGrey, JHaddach, MRowbottom, MNaeve, GSBrown, BSaunders, J Potent imidazole and triazole CB1 receptor antagonists related to SR141716. Bioorg Med Chem Lett14:1151-4 (2004) 
 
Cannabinoid receptor 1
Name:Cannabinoid receptor 1
Type:G Protein-Coupled Receptor (GPCR)
Mol. Mass.:52868.96
Organism:Homo sapiens (Human)
Description:P21554
Residue:472
BDBM50140229
NameBDBM50140229
Synonyms:1-(4-Chloro-phenyl)-5-(2,4-dichloro-phenyl)-1H-[1,2,4]triazole-3-carboxylic acid indan-1-ylamide | CHEMBL279787
TypeSmall organic molecule
Emp. Form.C24H17Cl3N4O
Mol. Mass.483.777
SMILESClc1ccc(cc1)-n1nc(nc1-c1ccc(Cl)cc1Cl)C(=O)NC1CCc2ccccc12