Reaction Details
TargetCannabinoid receptor 1
LigandBDBM50140235
Substrate/Competitorn/a
Meas. Tech.ChEBML_46467
Ki 270±n/a nM
Citation Dyck, BGoodfellow, VSPhillips, TGrey, JHaddach, MRowbottom, MNaeve, GSBrown, BSaunders, J Potent imidazole and triazole CB1 receptor antagonists related to SR141716. Bioorg Med Chem Lett14:1151-4 (2004) 
 
Cannabinoid receptor 1
Name:Cannabinoid receptor 1
Type:G Protein-Coupled Receptor (GPCR)
Mol. Mass.:52868.96
Organism:Homo sapiens (Human)
Description:P21554
Residue:472
BDBM50140235
NameBDBM50140235
Synonyms:5-(4-Chloro-2-methoxy-phenyl)-1-(2,4-dichloro-phenyl)-1H-[1,2,4]triazole-3-carboxylic acid (hexahydro-cyclopenta[c]pyrrol-2-yl)-amide | CHEMBL275416
TypeSmall organic molecule
Emp. Form.C23H22Cl3N5O2
Mol. Mass.506.812
SMILESCOc1cc(Cl)ccc1-c1nc(nn1-c1ccc(Cl)cc1Cl)C(=O)NN1CC2CCCC2C1