Reaction Details
TargetMelatonin receptor type 1B
LigandBDBM50452033
Substrate/Competitorn/a
Meas. Tech.ChEBML_105264
Ki 0.070000±n/a nM
Citation Sun, LQChen, JTakaki, KJohnson, GIben, LMahle, CDRyan, EXu, C Design and synthesis of benzoxazole derivatives as novel melatoninergic ligands. Bioorg Med Chem Lett14:1197-200 (2004) 
 
Melatonin receptor type 1B
Name:Melatonin receptor type 1B
Type:Enzyme
Mol. Mass.:40203.54
Organism:Homo sapiens (Human)
Description:P49286
Residue:362
BDBM50452033
NameBDBM50452033
Synonyms:CHEMBL2112690
TypeSmall organic molecule
Emp. Form.C24H28N2O2
Mol. Mass.376.4913
SMILESCCC(=O)NC[C@@H]1C[C@H]1c1cccc2nc(CCCCc3ccccc3)oc12