Reaction Details
TargetMelatonin receptor type 1B
LigandBDBM50452034
Substrate/Competitorn/a
Meas. Tech.ChEBML_105264
Ki 0.190000±n/a nM
Citation Sun, LQChen, JTakaki, KJohnson, GIben, LMahle, CDRyan, EXu, C Design and synthesis of benzoxazole derivatives as novel melatoninergic ligands. Bioorg Med Chem Lett14:1197-200 (2004) 
 
Melatonin receptor type 1B
Name:Melatonin receptor type 1B
Type:Enzyme
Mol. Mass.:40203.54
Organism:Homo sapiens (Human)
Description:P49286
Residue:362
BDBM50452034
NameBDBM50452034
Synonyms:CHEMBL2112724
TypeSmall organic molecule
Emp. Form.C17H20N2O2
Mol. Mass.284.3529
SMILESCCc1nc2cccc([C@@H]3C[C@H]3CNC(=O)C3CC3)c2o1