Reaction Details
TargetMelatonin receptor type 1A
LigandBDBM50452036
Substrate/Competitorn/a
Meas. Tech.ChEBML_105100
Ki 0.050000±n/a nM
Citation Sun, LQChen, JTakaki, KJohnson, GIben, LMahle, CDRyan, EXu, C Design and synthesis of benzoxazole derivatives as novel melatoninergic ligands. Bioorg Med Chem Lett14:1197-200 (2004) 
 
Melatonin receptor type 1A
Name:Melatonin receptor type 1A
Type:Enzyme
Mol. Mass.:39392.94
Organism:Homo sapiens (Human)
Description:P48039
Residue:350
BDBM50452036
NameBDBM50452036
Synonyms:CHEMBL2112734
TypeSmall organic molecule
Emp. Form.C25H28N2O2
Mol. Mass.388.502
SMILESO=C(NC[C@@H]1C[C@H]1c1cccc2nc(CCCCc3ccccc3)oc12)C1CC1