Reaction Details
TargetMelatonin receptor type 1B
LigandBDBM50140295
Substrate/Competitorn/a
Meas. Tech.ChEBML_105264
Ki 1.2±n/a nM
Citation Sun, LQChen, JTakaki, KJohnson, GIben, LMahle, CDRyan, EXu, C Design and synthesis of benzoxazole derivatives as novel melatoninergic ligands. Bioorg Med Chem Lett14:1197-200 (2004) 
 
Melatonin receptor type 1B
Name:Melatonin receptor type 1B
Type:Enzyme
Mol. Mass.:40203.54
Organism:Homo sapiens (Human)
Description:P49286
Residue:362
BDBM50140295
NameBDBM50140295
Synonyms:CHEMBL278922 | N-[(1R,2R)-2-(2-Isopropyl-2,3-dihydro-benzooxazol-7-yl)-cyclopropylmethyl]-acetamide
TypeSmall organic molecule
Emp. Form.C16H22N2O2
Mol. Mass.274.3581
SMILESCC(C)C1Nc2cccc([C@@H]3C[C@H]3CNC(C)=O)c2O1