Reaction Details
TargetMelatonin receptor type 1A
LigandBDBM50140300
Substrate/Competitorn/a
Meas. Tech.ChEBML_105100
Ki 3.1±n/a nM
Citation Sun, LQChen, JTakaki, KJohnson, GIben, LMahle, CDRyan, EXu, C Design and synthesis of benzoxazole derivatives as novel melatoninergic ligands. Bioorg Med Chem Lett14:1197-200 (2004) 
 
Melatonin receptor type 1A
Name:Melatonin receptor type 1A
Type:Enzyme
Mol. Mass.:39392.94
Organism:Homo sapiens (Human)
Description:P48039
Residue:350
BDBM50140300
NameBDBM50140300
Synonyms:1-Ethyl-3-[(1R,2R)-2-(2-ethyl-2,3-dihydro-benzooxazol-7-yl)-cyclopropylmethyl]-urea | CHEMBL19260
TypeSmall organic molecule
Emp. Form.C16H23N3O2
Mol. Mass.289.3727
SMILESCCNC(=O)NC[C@@H]1C[C@H]1c1cccc2NC(CC)Oc12