Reaction Details
TargetMelatonin receptor type 1B
LigandBDBM50140296
Substrate/Competitorn/a
Meas. Tech.ChEBML_105264
Ki 0.800000±n/a nM
Citation Sun, LQChen, JTakaki, KJohnson, GIben, LMahle, CDRyan, EXu, C Design and synthesis of benzoxazole derivatives as novel melatoninergic ligands. Bioorg Med Chem Lett14:1197-200 (2004) 
 
Melatonin receptor type 1B
Name:Melatonin receptor type 1B
Type:Enzyme
Mol. Mass.:40203.54
Organism:Homo sapiens (Human)
Description:P49286
Residue:362
BDBM50140296
NameBDBM50140296
Synonyms:CHEMBL553105 | N-[(1R,2R)-2-(2-Isopropyl-2,3-dihydro-benzooxazol-7-yl)-cyclopropylmethyl]-butyramide
TypeSmall organic molecule
Emp. Form.C18H26N2O2
Mol. Mass.302.4112
SMILESCCCC(=O)NC[C@@H]1C[C@H]1c1cccc2NC(Oc12)C(C)C