Reaction Details
TargetCoagulation factor X
LigandBDBM50140381
Substrate/Competitorn/a
Meas. Tech.ChEBML_48792
IC50 7±n/a nM
Citation Jia, ZJWu, YHuang, WZhang, PClizbe, LAGoldman, EASinha, UArfsten, AEEdwards, STAlphonso, MHutchaleelaha, AScarborough, RMZhu, BY 1-(2-Naphthyl)-1H-pyrazole-5-carboxylamides as potent factor Xa inhibitors. Part 2: A survey of P4 motifs. Bioorg Med Chem Lett14:1221-7 (2004) 
 
Coagulation factor X
Name:Coagulation factor X
Type:Enzyme
Mol. Mass.:54726.60
Organism:Homo sapiens (Human)
Description:n/a
Residue:488
BDBM50140381
NameBDBM50140381
Synonyms:2-(6-Chloro-naphthalen-2-yl)-5-methyl-2H-pyrazole-3-carboxylic acid [5-(2-sulfamoyl-phenyl)-pyrimidin-2-yl]-amide | CHEMBL20299
TypeSmall organic molecule
Emp. Form.C25H19ClN6O3S
Mol. Mass.518.975
SMILESCc1cc(C(=O)Nc2ncc(cn2)-c2ccccc2S(N)(=O)=O)n(n1)-c1ccc2cc(Cl)ccc2c1