Reaction Details
TargetPlasminogen
LigandBDBM50140370
Substrate/Competitorn/a
Meas. Tech.ChEBML_155592
IC50>10000±n/a nM
Citation Jia, ZJWu, YHuang, WZhang, PClizbe, LAGoldman, EASinha, UArfsten, AEEdwards, STAlphonso, MHutchaleelaha, AScarborough, RMZhu, BY 1-(2-Naphthyl)-1H-pyrazole-5-carboxylamides as potent factor Xa inhibitors. Part 2: A survey of P4 motifs. Bioorg Med Chem Lett14:1221-7 (2004) 
 
Plasminogen
Name:Plasminogen
Type:Protein
Mol. Mass.:90541.87
Organism:Rattus norvegicus
Description:Q01177
Residue:812
BDBM50140370
NameBDBM50140370
Synonyms:2-(3-Methanesulfonyl-naphthalen-2-yl)-5-methyl-2H-pyrazole-3-carboxylic acid [2-fluoro-4-(3-oxo-morpholin-4-yl)-phenyl]-amide | CHEMBL281175
TypeSmall organic molecule
Emp. Form.C26H23FN4O5S
Mol. Mass.522.548
SMILESCc1cc(C(=O)Nc2ccc(cc2F)N2CCOCC2=O)n(n1)-c1cc2ccccc2cc1S(C)(=O)=O