Reaction Details
TargetCoagulation factor X
LigandBDBM50140394
Substrate/Competitorn/a
Meas. Tech.ChEMBL_48641 (CHEMBL659621)
IC50 1±n/a nM
Citation Jia, ZJWu, YHuang, WZhang, PClizbe, LAGoldman, EASinha, UArfsten, AEEdwards, STAlphonso, MHutchaleelaha, AScarborough, RMZhu, BY 1-(2-Naphthyl)-1H-pyrazole-5-carboxylamides as potent factor Xa inhibitors. Part 2: A survey of P4 motifs. Bioorg Med Chem Lett14:1221-7 (2004) 
 
Coagulation factor X
Name:Coagulation factor X
Type:Enzyme
Mol. Mass.:54726.60
Organism:Homo sapiens (Human)
Description:n/a
Residue:488
BDBM50140394
NameBDBM50140394
Synonyms:2-(6-Chloro-naphthalen-2-yl)-5-methyl-2H-pyrazole-3-carboxylic acid [4-(3-oxo-morpholin-4-yl)-phenyl]-amide | CHEMBL279212
TypeSmall organic molecule
Emp. Form.C25H21ClN4O3
Mol. Mass.460.912
SMILESCc1cc(C(=O)Nc2ccc(cc2)N2CCOCC2=O)n(n1)-c1ccc2cc(Cl)ccc2c1