Reaction Details
TargetProthrombin
LigandBDBM50140360
Substrate/Competitorn/a
Meas. Tech.ChEBML_209078
IC50>10000±n/a nM
Citation Jia, ZJWu, YHuang, WZhang, PClizbe, LAGoldman, EASinha, UArfsten, AEEdwards, STAlphonso, MHutchaleelaha, AScarborough, RMZhu, BY 1-(2-Naphthyl)-1H-pyrazole-5-carboxylamides as potent factor Xa inhibitors. Part 2: A survey of P4 motifs. Bioorg Med Chem Lett14:1221-7 (2004) 
 
Prothrombin
Name:Prothrombin
Type:Protein
Mol. Mass.:70029.57
Organism:Homo sapiens (Human)
Description:P00734
Residue:622
BDBM50140360
NameBDBM50140360
Synonyms:2-(3-Methanesulfonyl-naphthalen-2-yl)-5-methyl-2H-pyrazole-3-carboxylic acid (2'-dimethylaminomethyl-3-fluoro-biphenyl-4-yl)-amide | CHEMBL20766
TypeSmall organic molecule
Emp. Form.C31H29FN4O3S
Mol. Mass.556.65
SMILESCN(C)Cc1ccccc1-c1ccc(NC(=O)c2cc(C)nn2-c2cc3ccccc3cc2S(C)(=O)=O)c(F)c1