Reaction Details
TargetKallikrein-1
LigandBDBM50140413
Substrate/Competitorn/a
Meas. Tech.ChEBML_92384
IC50>10000±n/a nM
Citation Jia, ZJWu, YHuang, WZhang, PSong, YWoolfrey, JSinha, UArfsten, AEEdwards, STHutchaleelaha, AHollennbach, SJLambing, JLScarborough, RMZhu, BY 1-(2-Naphthyl)-1H-pyrazole-5-carboxylamides as potent factor Xa inhibitors. Part 3: Design, synthesis and SAR of orally bioavailable benzamidine-P4 inhibitors. Bioorg Med Chem Lett14:1229-34 (2004) 
 
Kallikrein-1
Name:Kallikrein-1
Type:Enzyme
Mol. Mass.:28874.69
Organism:Homo sapiens (Human)
Description:P06870
Residue:262
BDBM50140413
NameBDBM50140413
Synonyms:2-(3-Fluoro-naphthalen-2-yl)-5-trifluoromethyl-2H-pyrazole-3-carboxylic acid [2-fluoro-4-(imino-pyrrolidin-1-yl-methyl)-phenyl]-amide CHEMBL279486
TypeSmall organic molecule
Emp. Form.C24H18F5N5O
Mol. Mass.487.4246
SMILESCN(C)C(=N)c1ccc(NC(=O)c2cc(nn2-c2cc3ccccc3cc2F)C(F)(F)F)c(F)c1