Reaction Details
TargetCoagulation factor X
LigandBDBM50140427
Substrate/Competitorn/a
Meas. Tech.ChEBML_48666
IC50 8±n/a nM
Citation Jia, ZJWu, YHuang, WZhang, PSong, YWoolfrey, JSinha, UArfsten, AEEdwards, STHutchaleelaha, AHollennbach, SJLambing, JLScarborough, RMZhu, BY 1-(2-Naphthyl)-1H-pyrazole-5-carboxylamides as potent factor Xa inhibitors. Part 3: Design, synthesis and SAR of orally bioavailable benzamidine-P4 inhibitors. Bioorg Med Chem Lett14:1229-34 (2004) 
 
Coagulation factor X
Name:Coagulation factor X
Type:Enzyme
Mol. Mass.:54726.60
Organism:Homo sapiens (Human)
Description:n/a
Residue:488
BDBM50140427
NameBDBM50140427
Synonyms:2-(3-Fluoro-naphthalen-2-yl)-5-methyl-2H-pyrazole-3-carboxylic acid [2-fluoro-4-(imino-piperidin-1-yl-methyl)-phenyl]-amide | CHEMBL20897
TypeSmall organic molecule
Emp. Form.C27H25F2N5O
Mol. Mass.473.5171
SMILESCc1cc(C(=O)Nc2ccc(cc2F)C(=N)N2CCCCC2)n(n1)-c1cc2ccccc2cc1F