Reaction Details
TargetKallikrein-1
LigandBDBM50140424
Substrate/Competitorn/a
Meas. Tech.ChEBML_92384
IC50>10000±n/a nM
Citation Jia, ZJWu, YHuang, WZhang, PSong, YWoolfrey, JSinha, UArfsten, AEEdwards, STHutchaleelaha, AHollennbach, SJLambing, JLScarborough, RMZhu, BY 1-(2-Naphthyl)-1H-pyrazole-5-carboxylamides as potent factor Xa inhibitors. Part 3: Design, synthesis and SAR of orally bioavailable benzamidine-P4 inhibitors. Bioorg Med Chem Lett14:1229-34 (2004) 
 
Kallikrein-1
Name:Kallikrein-1
Type:Enzyme
Mol. Mass.:28874.69
Organism:Homo sapiens (Human)
Description:P06870
Residue:262
BDBM50140424
NameBDBM50140424
Synonyms:2-(6-Chloro-naphthalen-2-yl)-5-methyl-2H-pyrazole-3-carboxylic acid [4-(N,N-dimethyl-carbamimidoyl)-2-fluoro-phenyl]-amide | CHEMBL20918
TypeSmall organic molecule
Emp. Form.C24H21ClFN5O
Mol. Mass.449.908
SMILESCN(C)C(=N)c1ccc(NC(=O)c2cc(C)nn2-c2ccc3cc(Cl)ccc3c2)c(F)c1