Reaction Details
TargetCoagulation factor X
LigandBDBM50140443
Substrate/Competitorn/a
Meas. Tech.ChEMBL_48626 (CHEMBL659607)
IC50 2±n/a nM
Citation Jia, ZJWu, YHuang, WZhang, PSong, YWoolfrey, JSinha, UArfsten, AEEdwards, STHutchaleelaha, AHollennbach, SJLambing, JLScarborough, RMZhu, BY 1-(2-Naphthyl)-1H-pyrazole-5-carboxylamides as potent factor Xa inhibitors. Part 3: Design, synthesis and SAR of orally bioavailable benzamidine-P4 inhibitors. Bioorg Med Chem Lett14:1229-34 (2004) 
 
Coagulation factor X
Name:Coagulation factor X
Type:Enzyme
Mol. Mass.:54726.60
Organism:Homo sapiens (Human)
Description:n/a
Residue:488
BDBM50140443
NameBDBM50140443
Synonyms:1-(6-Chloro-naphthalen-2-yl)-1H-tetrazole-5-carboxylic acid [4-(N,N-dimethyl-carbamimidoyl)-2-fluoro-phenyl]-amide | CHEMBL21250
TypeSmall organic molecule
Emp. Form.C21H17ClFN7O
Mol. Mass.437.857
SMILESCN(C)C(=N)c1ccc(NC(=O)c2nnnn2-c2ccc3cc(Cl)ccc3c2)c(F)c1