Reaction Details
TargetCoagulation factor X
LigandBDBM50140414
Substrate/Competitorn/a
Meas. Tech.ChEBML_48666
IC50 76±n/a nM
Citation Jia, ZJWu, YHuang, WZhang, PSong, YWoolfrey, JSinha, UArfsten, AEEdwards, STHutchaleelaha, AHollennbach, SJLambing, JLScarborough, RMZhu, BY 1-(2-Naphthyl)-1H-pyrazole-5-carboxylamides as potent factor Xa inhibitors. Part 3: Design, synthesis and SAR of orally bioavailable benzamidine-P4 inhibitors. Bioorg Med Chem Lett14:1229-34 (2004) 
 
Coagulation factor X
Name:Coagulation factor X
Type:Enzyme
Mol. Mass.:54726.60
Organism:Homo sapiens (Human)
Description:n/a
Residue:488
BDBM50140414
NameBDBM50140414
Synonyms:1-(3-Fluoro-naphthalen-2-yl)-1H-tetrazole-5-carboxylic acid [2-fluoro-4-(imino-piperidin-1-yl-methyl)-phenyl]-amide | CHEMBL416181
TypeSmall organic molecule
Emp. Form.C24H21F2N7O
Mol. Mass.461.4666
SMILESFc1cc(ccc1NC(=O)c1nnnn1-c1cc2ccccc2cc1F)C(=N)N1CCCCC1