Reaction Details
TargetCoagulation factor X
LigandBDBM50140413
Substrate/Competitorn/a
Meas. Tech.ChEBML_48666
IC50 3±n/a nM
Citation Jia, ZJWu, YHuang, WZhang, PSong, YWoolfrey, JSinha, UArfsten, AEEdwards, STHutchaleelaha, AHollennbach, SJLambing, JLScarborough, RMZhu, BY 1-(2-Naphthyl)-1H-pyrazole-5-carboxylamides as potent factor Xa inhibitors. Part 3: Design, synthesis and SAR of orally bioavailable benzamidine-P4 inhibitors. Bioorg Med Chem Lett14:1229-34 (2004) 
 
Coagulation factor X
Name:Coagulation factor X
Type:Enzyme
Mol. Mass.:54726.60
Organism:Homo sapiens (Human)
Description:n/a
Residue:488
BDBM50140413
NameBDBM50140413
Synonyms:2-(3-Fluoro-naphthalen-2-yl)-5-trifluoromethyl-2H-pyrazole-3-carboxylic acid [2-fluoro-4-(imino-pyrrolidin-1-yl-methyl)-phenyl]-amide CHEMBL279486
TypeSmall organic molecule
Emp. Form.C24H18F5N5O
Mol. Mass.487.4246
SMILESCN(C)C(=N)c1ccc(NC(=O)c2cc(nn2-c2cc3ccccc3cc2F)C(F)(F)F)c(F)c1