Reaction Details
TargetCoagulation factor X
LigandBDBM50140426
Substrate/Competitorn/a
Meas. Tech.ChEBML_48666
IC50 377±n/a nM
Citation Jia, ZJWu, YHuang, WZhang, PSong, YWoolfrey, JSinha, UArfsten, AEEdwards, STHutchaleelaha, AHollennbach, SJLambing, JLScarborough, RMZhu, BY 1-(2-Naphthyl)-1H-pyrazole-5-carboxylamides as potent factor Xa inhibitors. Part 3: Design, synthesis and SAR of orally bioavailable benzamidine-P4 inhibitors. Bioorg Med Chem Lett14:1229-34 (2004) 
 
Coagulation factor X
Name:Coagulation factor X
Type:Enzyme
Mol. Mass.:54726.60
Organism:Homo sapiens (Human)
Description:n/a
Residue:488
BDBM50140426
NameBDBM50140426
Synonyms:2-(3-Fluoro-naphthalen-2-yl)-5-methyl-2H-pyrazole-3-carboxylic acid [4-(N,N-dimethyl-carbamimidoyl)-thiophen-2-yl]-amide | CHEMBL280214
TypeSmall organic molecule
Emp. Form.C22H20FN5OS
Mol. Mass.421.491
SMILESCN(C)C(=N)c1csc(NC(=O)c2cc(C)nn2-c2cc3ccccc3cc2F)c1