Reaction Details
TargetCoagulation factor X
LigandBDBM50140440
Substrate/Competitorn/a
Meas. Tech.ChEBML_48666
IC50 479±n/a nM
Citation Jia, ZJWu, YHuang, WZhang, PSong, YWoolfrey, JSinha, UArfsten, AEEdwards, STHutchaleelaha, AHollennbach, SJLambing, JLScarborough, RMZhu, BY 1-(2-Naphthyl)-1H-pyrazole-5-carboxylamides as potent factor Xa inhibitors. Part 3: Design, synthesis and SAR of orally bioavailable benzamidine-P4 inhibitors. Bioorg Med Chem Lett14:1229-34 (2004) 
 
Coagulation factor X
Name:Coagulation factor X
Type:Enzyme
Mol. Mass.:54726.60
Organism:Homo sapiens (Human)
Description:n/a
Residue:488
BDBM50140440
NameBDBM50140440
Synonyms:2-(3-Fluoro-naphthalen-2-yl)-5-methyl-2H-pyrazole-3-carboxylic acid [3-(N,N-dimethyl-carbamimidoyl)-phenyl]-amide | CHEMBL279487
TypeSmall organic molecule
Emp. Form.C24H22FN5O
Mol. Mass.415.4628
SMILESCN(C)C(=N)c1cccc(NC(=O)c2cc(C)nn2-c2cc3ccccc3cc2F)c1