Reaction Details
TargetPotassium voltage-gated channel subfamily H member 2
LigandBDBM50140513
Substrate/Competitorn/a
Meas. Tech.ChEBML_65269
Ki 19000±n/a nM
Citation Caldwell, CGChen, PHe, JParmee, ERLeiting, BMarsilio, FPatel, RAWu, JKEiermann, GJPetrov, AHe, HLyons, KAThornberry, NAWeber, AE Fluoropyrrolidine amides as dipeptidyl peptidase IV inhibitors. Bioorg Med Chem Lett14:1265-8 (2004) 
 
Potassium voltage-gated channel subfamily H member 2
Name:Potassium voltage-gated channel subfamily H member 2
Type:Multi-pass membrane protein
Mol. Mass.:126672.65
Organism:Homo sapiens (Human)
Description:Q12809
Residue:1159
BDBM50140513
NameBDBM50140513
Synonyms:CHEMBL23660 | N-{4-[(S)-1-Amino-2-((S)-3-fluoro-pyrrolidin-1-yl)-2-oxo-ethyl]-cyclohexyl}-3,4-difluoro-benzamide
TypeSmall organic molecule
Emp. Form.C19H24F3N3O2
Mol. Mass.383.408
SMILESN[C@@H]([C@H]1CC[C@@H](CC1)NC(=O)c1ccc(F)c(F)c1)C(=O)N1CC[C@H](F)C1