Reaction Details
TargetDipeptidyl peptidase 2
LigandBDBM50140516
Substrate/Competitorn/a
Meas. Tech.ChEBML_160555
IC50 660±n/a nM
Citation Caldwell, CGChen, PHe, JParmee, ERLeiting, BMarsilio, FPatel, RAWu, JKEiermann, GJPetrov, AHe, HLyons, KAThornberry, NAWeber, AE Fluoropyrrolidine amides as dipeptidyl peptidase IV inhibitors. Bioorg Med Chem Lett14:1265-8 (2004) 
 
Dipeptidyl peptidase 2
Name:Dipeptidyl peptidase 2
Type:Protein
Mol. Mass.:54339.29
Organism:Homo sapiens (Human)
Description:Q9UHL4
Residue:492
BDBM50140516
NameBDBM50140516
Synonyms:CHEMBL23110 | N-{4-[(S)-1-Amino-2-(3,3-difluoro-pyrrolidin-1-yl)-2-oxo-ethyl]-cyclohexyl}-3,4-difluoro-benzamide
TypeSmall organic molecule
Emp. Form.C19H23F4N3O2
Mol. Mass.401.3984
SMILESN[C@@H]([C@H]1CC[C@@H](CC1)NC(=O)c1ccc(F)c(F)c1)C(=O)N1CCC(F)(F)C1