Reaction Details
TargetPotassium voltage-gated channel subfamily H member 2
LigandBDBM50140517
Substrate/Competitorn/a
Meas. Tech.ChEBML_65269
Ki 39000±n/a nM
Citation Caldwell, CGChen, PHe, JParmee, ERLeiting, BMarsilio, FPatel, RAWu, JKEiermann, GJPetrov, AHe, HLyons, KAThornberry, NAWeber, AE Fluoropyrrolidine amides as dipeptidyl peptidase IV inhibitors. Bioorg Med Chem Lett14:1265-8 (2004) 
 
Potassium voltage-gated channel subfamily H member 2
Name:Potassium voltage-gated channel subfamily H member 2
Type:Multi-pass membrane protein
Mol. Mass.:126672.65
Organism:Homo sapiens (Human)
Description:Q12809
Residue:1159
BDBM50140517
NameBDBM50140517
Synonyms:CHEMBL283368 | N-[4-((S)-1-Amino-2-oxo-2-thiazolidin-3-yl-ethyl)-cyclohexyl]-2-trifluoromethyl-benzamide
TypeSmall organic molecule
Emp. Form.C19H24F3N3O2S
Mol. Mass.415.473
SMILESN[C@@H]([C@H]1CC[C@@H](CC1)NC(=O)c1ccccc1C(F)(F)F)C(=O)N1CCSC1