Reaction Details
TargetPotassium voltage-gated channel subfamily H member 2
LigandBDBM50140527
Substrate/Competitorn/a
Meas. Tech.ChEBML_65269
Ki>90000±n/a nM
Citation Caldwell, CGChen, PHe, JParmee, ERLeiting, BMarsilio, FPatel, RAWu, JKEiermann, GJPetrov, AHe, HLyons, KAThornberry, NAWeber, AE Fluoropyrrolidine amides as dipeptidyl peptidase IV inhibitors. Bioorg Med Chem Lett14:1265-8 (2004) 
 
Potassium voltage-gated channel subfamily H member 2
Name:Potassium voltage-gated channel subfamily H member 2
Type:Multi-pass membrane protein
Mol. Mass.:126672.65
Organism:Homo sapiens (Human)
Description:Q12809
Residue:1159
BDBM50140527
NameBDBM50140527
Synonyms:(S)-2-Amino-2-cyclohexyl-1-((S)-3-fluoro-pyrrolidin-1-yl)-ethanone | CHEMBL22511
TypeSmall organic molecule
Emp. Form.C12H21FN2O
Mol. Mass.228.3063
SMILESN[C@@H](C1CCCCC1)C(=O)N1CC[C@H](F)C1