Reaction Details
TargetPotassium voltage-gated channel subfamily H member 2
LigandBDBM50140531
Substrate/Competitorn/a
Meas. Tech.ChEBML_65269
Ki 43000±n/a nM
Citation Caldwell, CGChen, PHe, JParmee, ERLeiting, BMarsilio, FPatel, RAWu, JKEiermann, GJPetrov, AHe, HLyons, KAThornberry, NAWeber, AE Fluoropyrrolidine amides as dipeptidyl peptidase IV inhibitors. Bioorg Med Chem Lett14:1265-8 (2004) 
 
Potassium voltage-gated channel subfamily H member 2
Name:Potassium voltage-gated channel subfamily H member 2
Type:Multi-pass membrane protein
Mol. Mass.:126672.65
Organism:Homo sapiens (Human)
Description:Q12809
Residue:1159
BDBM50140531
NameBDBM50140531
Synonyms:CHEMBL277693 | {4-[(S)-1-Amino-2-((R)-3-fluoro-pyrrolidin-1-yl)-2-oxo-ethyl]-cyclohexyl}-carbamic acid benzyl ester
TypeSmall organic molecule
Emp. Form.C20H28FN3O3
Mol. Mass.377.453
SMILESN[C@@H]([C@H]1CC[C@@H](CC1)NC(=O)OCc1ccccc1)C(=O)N1CC[C@@H](F)C1