Reaction Details
TargetPotassium voltage-gated channel subfamily H member 2
LigandBDBM50140536
Substrate/Competitorn/a
Meas. Tech.ChEBML_65269
Ki 28000±n/a nM
Citation Caldwell, CGChen, PHe, JParmee, ERLeiting, BMarsilio, FPatel, RAWu, JKEiermann, GJPetrov, AHe, HLyons, KAThornberry, NAWeber, AE Fluoropyrrolidine amides as dipeptidyl peptidase IV inhibitors. Bioorg Med Chem Lett14:1265-8 (2004) 
 
Potassium voltage-gated channel subfamily H member 2
Name:Potassium voltage-gated channel subfamily H member 2
Type:Multi-pass membrane protein
Mol. Mass.:126672.65
Organism:Homo sapiens (Human)
Description:Q12809
Residue:1159
BDBM50140536
NameBDBM50140536
Synonyms:(S)-2-Amino-2-cyclohexyl-1-thiazolidin-3-yl-ethanone | CHEMBL23223
TypeSmall organic molecule
Emp. Form.C11H20N2OS
Mol. Mass.228.354
SMILESN[C@@H](C1CCCCC1)C(=O)N1CCSC1